BDBM78235 1-isopropyl-3-(6,7,8,9-tetrahydrobenzocyclohepten-5-ylideneamino)thiourea::1-propan-2-yl-3-(6,7,8,9-tetrahydrobenzo[7]annulen-5-ylideneamino)thiourea::MLS000391151::SMR000260188::cid_4014580
SMILES CC(C)NC(=S)NN=C1CCCCc2ccccc12
InChI Key InChIKey=BJQBEJYZFPIBCQ-UHFFFAOYSA-N
Data  2 IC50
  Tab Delimited (TSV)   2D SDfile   Computed 3D by Vconf -m prep SDfile
Find this compound or compounds like it in BindingDB:
Activity Spreadsheet -- Enzyme Inhibition Constant Data from BindingDB
Found 1 hit for monomerid = 78235
TargetMitochondrial import inner membrane translocase subunit TIM23(Saccharomyces cerevisiae S288c)
Burnham Center For Chemical Genomics
Curated by PubChem BioAssay
LigandPNGBDBM78235(1-isopropyl-3-(6,7,8,9-tetrahydrobenzocyclohepten-...)
Affinity DataIC50:  1.09E+4nM. Assay description: Data Source: Sanford-Burnham Center for Chemical Genomics (SBCCG) Source Affiliation: Sanford-Burnham Medical Research Institute(SBMRI, San Diego, CA...
In DepthDetails PCBioAssay